Generics are erased and only the last overload signature is propagated into the new function type. RaisedButton' is deprecated and shouldn't be used. yup schema[(intermediate value)(intermediate value)(intermediate value)] is not a function, Please specify classes allowed for unserialization in 2nd argument, DeprecationWarning: executable_path has been deprecated, please pass in a Service object, Bean identifier index inconsistency detected. ?9Xob@@QAE_NABV0@@Z) referenced in function _main C:\Users\mabdu\Desktop\final practice\final practice\main.obj final practice error solution, tDestination" can only be called on an active agent that has been placed on a NavMesh. TypeScript is a typed superset of JavaScript that compiles to plain JavaScript. pdflatex.core - GUI framework cannot be initialized. Could not open a connection to your authentication agent. Can't bind to 'ngForOf' since it isn't a known property of 'div'. find_element_by_* commands are deprecated. Entities exist of type Shortcut link and Shortcut set Default. For more information, see about_Execution_Policies at https:/go.microsoft.com/fwlink/?LinkID=135170, policies for setting virtual environment -python, ng : File C:\Users\nEW u\AppData\Roaming\npm\ng.ps1 cannot be loaded. Assign an ES5 constructor function to a variable of constructor type. The module factory of `jest.mock()` is not allowed to reference any out-of-scope variables. If you want the contract to be non-deployable, making it "abstract" is sufficient. Where developers & technologists share private knowledge with coworkers, Reach developers & technologists worldwide, Thanks for helping, but i need to implement because i use this class in another like this : class viewModelListe{ item: T; itemBuilder(json?) PANIC: Missing emulator engine program for 'x86' CPU.

ouldn't adb reverse: device 'adb' not found ubuntu andrid emulator. Please update to the latest version (version [2]). in file D:\Wynch\vendor\laravel\passport\src\ClientRepository.php on line 122. Target class [App\Http\Controllers\Request] does not exist. Please try again. Beyond being recognized in the contextual type of an object literal, the interface acts like any empty interface. It's being deprecated in favor of Android embedding v2. Please create one, laravel creating a personal access client, RuntimeException: Personal access client not found. woocomerce Invalid signature - provided signature does not match. You must import one of the following modules at your application root: MatNativeDateModule, MatMomentDateModule, or provide a custom implementation, how to stop user from clicking outside sweetalert 2, how to restrict user from resize textarea, how to make full screen images slider in bootstrap 4, mongodb create admin user for all databases, The link you followed has expired. Method 'removeObserver' cannot be called on 'WidgetsBinding?' Firebase deploy error - Cannot find module 'firebase', algorithms and their time and space complexity, how to find a list of columns containing null values. ERESOLVE unable to resolve dependency tree. Property 'form' has no initializer and is not definitely assigned in the constructor. This utility does not return a transformed type. WARNING: pip is being invoked by an old script wrapper. When I try to use this interface, it says: Any ideas? If I understand what you're trying to do, you could use an abstract class instead of an interface. Expected a state variable declaration. specify an explicit value for `android:exported` when the corresponding component has an intent filter defined. Property 'products' has no initializer and is not definitely assigned in the constructor. Difference between Constructor and ngOnInit, TypeScript: index signature is missing with ArrayLike interface, 'XXX' provides no match for the signature 'new (): XXX'. // ^ = Could not get LSP result: bou>t<; // ^ = type T2 = [pattern: string | RegExp, flags? If Type has no explicitly declared this parameter, the result is simply Type. Constructs a type consisting of all properties of T set to required. Can a human colony be self-sustaining without sunlight using mushrooms? Newtonsoft.Json.JsonSerializationException: 'Self referencing loop detected for property, TypeError: app.use() requires a middleware function. DeprecationWarning: current Server Discovery and Monitoring engine is deprecated, property 'firstname' has no initializer and is not definitely assigned in the constructor. [VERBOSE-2:ui_dart_state.cc(209)] Unhandled Exception: [core/not-initialized] Firebase has not been correctly initialized. object references an unsaved transient instance - save the transient instance before flushing. i have a "compilation" problem in this case : class 'myDataObject' incorrectly implements interface 'IDataObjectConstructor'. code ERESOLVE npm ERR! An object conforming to an interface doesn't really give you a foothold with which to invoke a constructor. + Hide status bar in flutter, firebase Use of unresolved identifier 'InstanceID', error: variable or field 'play' declared void, foreach ($activate_this as $plugin) { if (!in_array($plugin, $active_plugins)) { array_push($active_plugins, $plugin); update_option('active_plugins', $active_plugins); }, Assets/Standard Assets/Utility/SimpleActivatorMenu.cs(11,16): error CS0619: 'GUIText' is obsolete: 'GUIText has been removed. You can run `manage.py createsuperuser` in your project to create one manually. Install or enable PHP's pcntl extension. ActiveRecord::ProtectedEnvironmentError: You are attempting to run a destructive action against your 'production' database. ', codeblocksdefinition of implicitly-declared 'Player::Player()'|. why we should Only Call Hooks at the Top Level. Why supplied paramter does not match signiture of call target when object with correct interface was supplied? : string]. 'jupyter' is not recognized as an internal or external command, operable program or batch file. Error 1 error LNK2019: unresolved external symbol public: bool __thiscall Xob::operator!=(class Xbox const &) (? error: You have not concluded your merge (MERGE_HEAD exists). Please create one. Migrate to setEnabledSystemUIMode. '@material-ui/core' does not contain a default export (imported as 'Button'. how to change input text color in flutter, Failed to execute goal org.apache.maven.plugins:maven-surefire-plugin:2.20.1:test (default-test) on project upload, how to check if a value exists in map golang, how to check if value exiets in map in go, how to I change the name of a column in rails, Your Ruby version is 3.0.0, but your Gemfile specified 2.7.4, Your Ruby version is 2.7.0, but your Gemfile specified 2.7.1, rails migration update column default value, dart capitalize first letter of each word, increase the size of the image in Swiftui, how to call a function after delay in kotlin android, Cannot inline bytecode built with JVM target 1.8 into bytecode that is being built with JVM target 1.6. still, this is the expected implementation pattern for this.. constructor provides no match for signature new. For instance, you can do: + windows, Editor/ARKitBuildProcessor.cs(108,71): error CS1729: 'ShaderKeyword' does not contain a constructor that takes 2 arguments, rust Why the error "the trait `FnOnce<()>` is implemented but that implementation is not `const, Error: Invariant failed: You should not use outside a . filterBlacklist = ( ); filterWhitelist = ( ); restrictWeb = 1; useContentFilter = 0; useContentFilterOverrides = 0; whitelistEnabled = 0; Error: Failed to deserialize user out of session, flutter uses unchecked or unsafe operations, has no initializer and is not definitely assigned in the constructor, This configuration section cannot be used at this path. Import "rest_framework.views" could not be resolved, ModuleNotFoundError: No module named 'rest_framework', Fatal error in launcher: Unable to create process using pip.exe. Action PostsController@store not defined. How does Android Studio refactor a stateless widget to a stateful widget. Should I remove older low level jobs/education from my CV at this point? windows error, codecrepper npm ERR! fatal: Not possible to fast-forward, aborting. how to authenticate token in react using axios, use axios cancel token in react.js useEffect, W: GPG error: http://packages.ros.org/ros/ubuntu xenial InRelease: The following signatures were invalid: KEYEXPIRED 1622248854, error: no override and no default toolchain set. implicit super constructor User() is undefined for default constructor. Can't bind to 'formGroup' since it isn't a known property of 'form, The file C:\Users\user\AppData\Roaming\npm\ng.ps1 is not digitally signed. not working, ModuleNotFoundError: No module named 'corsheaders', Error: listen EADDRINUSE: address already in use :::3000, npm EACCES: permission denied, access '/usr/local/lib'. [ERROR:flutter/lib/ui/ui_dart_state.cc(209)] Unhandled Exception: [core/not-initialized] Firebase has not been correctly initialized. How to use view binding in android studio, not works in CustomExceptionHandler because in DefaultHandlerExceptionResolver, java.lang.AbstractMethodError: at android.view.View.dispatchWindowInsetsAnimationProgress flutter, how to access hover & active property in nativeElement in directive, AttributeError: module 'jwt' has no attribute 'encode', :app:transformNativeLibsWithMergeJniLibsForDebug, use npm to update packages to latest version, MatDatepicker: No provider found for DateAdapter. The ThisType marker interface is simply an empty interface declared in lib.d.ts. I've created an interface for a class, and I want to define the signature to the constructor. when attempting to reassign properties of a frozen object). Constructs a type by extracting from Type all union members that are assignable to Union. Error: Cannot run with sound null safety, because the following dependencies don't support null safety: ERROR: Could not find a version that satisfies the requirement tensorflow (from versions: none) ERROR: No matching distribution found for tensorflow. You can either provide `room.schemaLocation` annotation processor argument OR set exportSchema to false. You cannot run this script on the current system. Failed to start mongod.service: Unit mongod.service not found. It doesn't really make sense to make in interface that covers object values, and also a way to construct them. Uncaught (in promise) FirebaseError: Missing or insufficient permissions. You are attempting to run a destructive action against your 'production' database. For more information, see about_Execution_Policies at https:/go.microsoft.com/fwlink/?LinkID=135170. Constructs a type with all properties of Type set to optional. Design patterns for asynchronous API communication. This happens when the section is locked at a parent level. Usually this means you've attempted to use a Firebase service before calling `Firebase.initializeApp`.

This utility will return a type that represents all subsets of a given type. The factory function expects an IDataObjectConstructor and we're passing the class itself and you don't get any compilation errors even though your class isn't declared to implement it.

SLF4J: Defaulting to no-operation (NOP) logger implementation, ERROR Error: No value accessor for form control with unspecified name attribute, Could not connect to Redis at 127.0.0.1:6379: Connection refused, how do you remove a remove element from array in javascript, how to remove remote origin from git repo. Make sure this package is installed. 1 ERROR in child compilations (Use 'stats.children: true' resp. ' Instead, you would need to work with the static side of the class directly. Constructs a type by excluding null and undefined from Type. Syntax Error: Error: PostCSS plugin tailwindcss requires PostCSS 8. To subscribe to this RSS feed, copy and paste this URL into your RSS reader. This will fail in a future version of pip. flutter Concurrent modification during iteration: Instance(length:52) of '_GrowableList'. Ahh. For more information about running scripts and setting execution policy, see about_Execution_Policies at, \Activate.ps1 cannot be loaded because running scripts is disabled on this system. [2]: the default discovery settings are unsuitable for production use; at least one of [discovery.seed_hosts, discovery.seed_providers, cluster.initial_master_nodes] must be configured, dimsbackgroundduringpresentation' was deprecated in ios 12.0, The ad size and ad unit ID must be set before loadAd is called. error CS0619: 'GUIText' is obsolete: 'GUIText has been removed. angular An accessor cannot be declared in an ambient context. Sass Loader has been initialized using an options object that does not match the API schema. Constructs a type with a set of properties Keys of type Type. try correcting the name to the name of an existing getter, or defining a getter or field named 'body1'. --stats-children' for more details), Argument of type 'InitialState' is not assignable to parameter of type 'never'. roperty 'form' has no initializer and is not definitely assigned in the constructor. ServicesBinding.defaultBinaryMessenger was accessed before the binding was initialized. Can't bind to 'ngModel' since it isn't a known property of 'input'. I know more than a few languages, but I don't know any that let you include constructor signatures in an interface. Site design / logo 2022 Stack Exchange Inc; user contributions licensed under CC BY-SA. What happens if I accidentally ground the output of an LDO regulator? initComponents(); rev2022.7.21.42639. Aborting, npm ERR! Execution failed for task ':app:processDebugGoogleServices'. Can't bind to 'ngModel' since it isn't a known property of 'input', Uncaught ReferenceError: $ is not defined. Scientifically plausible way to sink a landmass, Extract 2D quad mesh from 3D hexahedral mesh, mv fails with "No space left on device" when the destination has 31 GB of space remaining. Default FirebaseApp is not initialized in this process com.example.projectmanagementtool. Although I'm not sure if that's what you want, because I don't totally understand what you want. By clicking Post Your Answer, you agree to our terms of service, privacy policy and cookie policy. db_1 | Error: Database is uninitialized and superuser password is not specified. Is it patent infringement to produce patented goods but take no compensation? Removes the this parameter from Type. Constructs a type with all properties of Type set to readonly, meaning the properties of the constructed type cannot be reassigned. Module not found: Can't resolve 'react-router-dom'. Could you give an example of how you'd use this? TypeScript is a language for application-scale JavaScript development. Why is the US residential model untouchable and unquestionable? Ensure that the [name, id, data] of the Livewire component wasn't tampered with between requests. How does typescript interfaces with construct signatures work?

Treating warnings as errors because process.env.CI = true. ImportError: Could not import PIL.Image. xcrun: error: invalid active developer path (/Applications/Xcode.app/Contents/Developer), digital envelope routines unsupported react, error en el start de package. error: Your local changes to the following files would be overwritten by merge: reported error code 1 when it ended: error: Your local changes to the following files would be overwritten by merge: composer.lock Please commit your changes or stash them before you merge. How does one show this complex expression equals a natural number? UnityEngine.AI.NavMeshAgent:SetDestination (UnityEngine.Vector3), undefined method `desc' for Sinatra::Application:Class, Status of useMutation not shared across usages/components with custom hook (like useQuery does). An object satisfying an interface is not its constructor. Unable to correct problems, you have held broken packages. this.setExtendedState(JFrame.MAXIMIZED_BOTH); WARNING: There was an error checking the latest version of pip. }, Object.noSuchMethod (dart:core-patch/object_patch.dart:54:5), flutter prefer const with constant constructors, cannot-update-a-component-forwardrefbasenavigationcontainer-while-renderin. The use of `load_img` requires PIL. Can't operate. Please use InMemory or LocalFileReference classes. Cannot find module: 'react-router-dom'. Then for convenience we define a constructor function createClock that creates instances of the type that is passed to it. color ? The term 'ng' is not recognized as the name of a cmdlet, function, script file, or operable program. ERROR: no schema has been selected to create in. Press J to jump to the feed. google calendar api getting protected propertys, creating ansible vault for aws credentials, habilitar y configuracion ripv2 cisco packet tracer, sequelize 4 sort on joined table attribute, january february march april may june july august september october november december, salesforce move records from sandbox to production, conflicting provisioning settings error when I try to archive to submit an iOS app, Why are there so many earthquakes in Alaska, A(n) _______________ is a relation of harmony, conformity, accord, or affinity, remove gray row at bottom of datagridview, hoow to get position of item in ItemTouchHelper, twitter bot know if you already retweeted, Xcode xip The archive does not come from Apple, sitefinity adding the link option to designer view, servicenow how to populate the default value with next week date,

» Page not found

Page not found or has been removed. Please browse one of our other pages.

Top Slot Sites

Casino Titan

Casino Titan
There’s a free (no-deposit) $7 for new players at Casino Titan plus you also receive up to $3000 in new player Bonuses...

Play Now

Cinema Casino

Cinema Casino
Microgaming is behind another big successful online casino, Cinema Casino. Cinema Casino has over 200 casino games to choose from. This online casino is giving $1000 away for free to try their games and 60 minutes on the clock. ...

Play Now

WinPalace Casino

WinPalace Casino
WinPalace welcomes with an exclusive casino bonus of $1000 CASH ! Get a generous 200% bonus (up to $500) not only on your first but on your 2nd deposit too! This incredible bonus awards you with $1,000 in BONUS CASH! Good luck!...

Play Now

Slots Plus Casino

Slots Plus Casino
Slots Plus Casino have chosen Real Time Gaming software, which offers online players a great gaming experience, which is a step ahead of the rest. 125% welcome bonus is offered to New players at Slot Plus Casino! ...

Play Now

7 Sultans Casino

7 Sultans Casino
9 magical bonuses of $1000 await you at 7 Sultans Casino...

Play Now

Slots Jungle

Slots Jungle
Slots Jungle will match each of your first 10 deposits by 100% up to $1,000 for a grand total of $10,000. No other online casino offers you this much extra free cash to play with. So start cashing in today! To collect, simply redeem bonus code: JUNGLEWELCOME ...

Play Now

Contributors

We Recommend